发 帖  
原厂入驻New
[问答]

安装skyeye遇到的问题

1154
分享
使用的是VM安装的REDHAT9,编译的源代码是skyeye-1.3.3_rel.tar.gz
./configure
make之后出现了以下的错误、、、
请一下怎么解决,谢谢!!!!!!!!!

ctrl/scheduler.c:51: parse error before "thread_lock"
ctrl/scheduler.c:51: warning: data definition has no type or storage class
ctrl/scheduler.c: In function `thread_scheduler':
ctrl/scheduler.c:83: implicit declaration of function `pthread_rwlock_wrlock'
ctrl/scheduler.c:85: implicit declaration of function `pthread_rwlock_unlock'
ctrl/scheduler.c: In function `init_thread_scheduler':
ctrl/scheduler.c:100: implicit declaration of function `pthread_rwlock_init'
ctrl/scheduler.c:104: warning: passing arg 1 of `create_thread' from incompatible pointer type
ctrl/scheduler.c: In function `fini_thread_scheduler':
ctrl/scheduler.c:210: implicit declaration of function `pthread_rwlock_destroy'
ctrl/scheduler.c: At top level:
ctrl/scheduler.c:220: parse error before "timer_lock"
ctrl/scheduler.c:220: warning: data definition has no type or storage class
make[2]: *** [scheduler.lo] Error 1
make[2]: Leaving directory `/home/vinux/skyeye/common'
make[1]: *** [all-recursive] Error 1
make[1]: Leaving directory `/home/vinux/skyeye'
make: *** [all] Error 2
0
2014-6-21 20:06:54   评论 分享淘帖 邀请回答
3个回答
先看看 skyeye 包里的 README 和 INSTALL,检查编译环境是否合适
2014-6-28 22:49:14 评论

举报

先看看 skyeye 包里的 README 和 INSTALL,检查编译环境是否合适
2014-6-28 22:49:47 评论

举报

撰写答案

你正在撰写答案

如果你是对答案或其他答案精选点评或询问,请使用“评论”功能。

高级模式
您需要登录后才可以回帖 登录 | 注册

声明:本文内容及配图由入驻作者撰写或者入驻合作网站授权转载。文章观点仅代表作者本人,不代表电子发烧友网立场。文章及其配图仅供工程师学习之用,如有内容图片侵权或者其他问题,请联系本站作侵删。 侵权投诉
我要提问
关闭

站长推荐 上一条 /8 下一条

快速回复 返回顶部 返回列表